{"text_format":"1","workbook":"xlsx","n_sheets":16,"sheets":["Cover Page","Input","Input_Output_LSA","Input_Output_LSA_SALS_SSTFC","LSA_to_LTA","FVSplit","Current_LTA_Rebalance","TTFAC_Protection","Glossary","IntermediateCalcs","Result","LTA Table","LSA Table","LSDBA Table","Protection Table","VersionHistory"],"not_rendered":{"charts":0,"images":1,"macros":1,"external_links":0,"defined_names":134,"comments":7,"pivot_tables":0},"unopened":[],"bounds":{"document_bytes":16777216,"sheet_cells":100000,"rows_first":2000,"rows_last":500,"rows_between":2000,"halvings":0,"cell_chars":16384,"cell_head_chars":4096},"cells_cut":0,"cells_raw":0,"read":"whole","date_system":"1900"}

{"sheet":"Cover Page","index":0,"n_rows":0,"n_cols":0,"rows_kept":0,"cut":false,"hidden":false,"merged":[]}

{"sheet":"Input","index":1,"n_rows":25,"n_cols":29,"rows_kept":25,"cut":false,"hidden":false,"merged":[]}
[null,null,null,null,null,"LTA% used up by","RL policies","Other Provider","     LTA Spreadsheet",null,null,null,null,null,null,null,null,null,null,null,null,null,null,null,null,null,null,null,0]
[null,"General Information Mandatory Inputs for calculation or Populating Data",null,null,null,"RL Policy1/ This Policy",0,0]
[null,null,null,null,null,"RL Policy2",0,0]
[null,"Policy holder name*",null,null,null,"RL Policy3",0,0]
[null,"Policy number*",null,null,null,"RL Policy4",0,0,null,"LTA % used up with other provider",{"$f":"SUM(H2:H21)","v":0}]
[null,"Date of Birth*",null,"1970-08-21",null,"RL Policy5",0,0,null,"Total LTA % used up by other RL policies",{"$f":"SUM(G2:G21)","v":0}]
[null,"Today's Date*",null,"2025-08-21",null,"RL Policy6",0,0]
[null,"National Insurance Number*",null,null,null,"RL Policy7",0,0,null,"Type of most recent BCE"]
[null,null,null,null,null,"RL Policy8",0,0,null,null,null,null,null,null,"Product*"]
[null,null,null,null,null,"RL Policy9",0,0,null,"LTA Protection",null,null,null,null,"Location:",{"$f":"IF(Product_type=\"TAL-ID\",\"\\\\netehnas01\\income_drawdown\\New\\LTA Calculation\",\"\\\\royallondongroup.com\\depts\\RLIPD\\Special\\Calcs Projects\\LTA Spreadsheet Changes\\Phase 2\\Testing\\Multiple Policy\")","v":"\\\\royallondongroup.com\\depts\\RLIPD\\Special\\Calcs Projects\\LTA Spreadsheet Changes\\Phase 2\\Testing\\Multiple Policy"}]
[null,null,null,null,null,"RL Policy10",0,0,null,"Amount if Protected LTA"]
[null,"Age 75 specific Input",null,null,null,"RL Policy11",0,0]
[null,null,null,null,null,"RL Policy12",0,0]
[null,"Type of test (testing against)",null,null,null,"RL Policy13",0,0]
[null,null,null,null,null,"RL Policy14",0,0]
{"$rows_left_out":11}
{"sheet":"Input_Output_LSA","index":2,"n_rows":101,"n_cols":14,"rows_kept":101,"cut":false,"hidden":false,"merged":[[86,4,92,6]]}
[]
[null,null,null,null,null,null,null,null,null,null,null,null,null,"RBCE type options"]
[null,"General Information Mandatory Inputs for calculation or Populating Data",null,null,null,null,null,null,null,null,null,null,null,"PCLS"]
[null,null,null,null,null,null,null,null,null,null,null,null,null,"UFPLS"]
[]
[null,"Policy holder name"]
[null,"Policy number"]
[null,"Date of Birth*"]
[null,"Quote Date*"]
[]
[]
[" **This is sum of LTA% for  all Pre and Post April 2024 BCE events including SIHLs.  PLEASE NOTE: Oryx has known issues with calculating LTA% for SIHL and UFPLS. Please calculate LTA% manually using 'Input' tab of this spreadsheet for such cases","LTA % Used at Quote Date"]
[]
[]
[null,"Pre-commencement pensions",null,null,null,null,null,"Crystallised FV (Post Apr 2024) for Death and Serious Ill Health Lumpsum",null,"**Leave blank if:\n•\tTransferring a Beneficiary IR (Ben IR), or\n•\tCustomer is over 75 years old when they died, or\n•\tCustomer is under 75 when they died, however the bereavement claim is paid more than 2 years after notification of death"]
{"$rows_left_out":87}
{"sheet":"Input_Output_LSA_SALS_SSTFC","index":3,"n_rows":16,"n_cols":5,"rows_kept":16,"cut":false,"hidden":false,"merged":[]}
[null,"LSA and LSDBA Calculation for SALS and SSTFC"]
["Input"]
[]
[null,"Effective Date"]
[null,"Total Crystallised Amount"]
[null,"Total Tax-free Cash Amount",null,null,{"$f":"IF(ISERROR(LSA_Total),\"WARNING: LSA used up amount till date is not available\",IF(OR(Input_Output_LSA!D91=0),\"No LSA remaining hence can't take Tax free cash\",\"\"))","v":"WARNING: LSA used up amount till date is not available"}]
[]
["Output"]
[]
[null,"LSA Used for SALS and SSTFC only",{"$f":"ROUND(IF(SALS_SSTFC_TFC_Amt<ROUND(0.25*SALS_SSTFC_Crystallised_Amt,2),SALS_SSTFC_TFC_Amt,0.25*SALS_SSTFC_Crystallised_Amt),2)","v":0},null,{"$f":"IF(SALS_SSTFC_Eff_Dt=\"\",\"Please enter effective Date\",IF(SALS_SSTFC_LSA>VLOOKUP(IF(MONTH(SALS_SSTFC_Eff_Dt)<4,YEAR(SALS_SSTFC_Eff_Dt)-1,IF(AND(MONTH(SALS_SSTFC_Eff_Dt)=4,DAY(SALS_SSTFC_Eff_Dt)<6),YEAR(SALS_SSTFC_Eff_Dt)-1,YEAR(SALS_SSTFC_Eff_Dt))),LSA_Table,4),\"As the customer has used all of their LSA, please update the Event 24 tracker held Here --> M:\\Customer Commitments\\01. RLI Servicing\\04. Transfers\\Event 24\",\"\"))","v":"Please enter effective Date"}]
[]
[null,"LSDBA Used for SALS and SSTFC only",{"$f":"ROUND(SALS_SSTFC_TFC_Amt,2)","v":0}]
[]
[null,"Total LSA Used **includes LSA from Input_Output_LSA sheet",{"$f":" IF(ISERROR(LSA_Total),SALS_SSTFC_LSA,SALS_SSTFC_LSA+LSA_Total)","v":0},null,{"$f":"IF(ISERROR(LSA_Total),\"LSA used in Input_Output_LSA sheet is either not calculated or there is an error\",\"\")","v":"LSA used in Input_Output_LSA sheet is either not calculated or there is an error"}]
[null,null,null,null,{"$f":"IF(SALS_SSTFC_Eff_Dt=\"\",\"Please enter effective Date\",IF(SALS_SSTFC_Total_LSA>VLOOKUP(IF(MONTH(SALS_SSTFC_Eff_Dt)<4,YEAR(SALS_SSTFC_Eff_Dt)-1,IF(AND(MONTH(SALS_SSTFC_Eff_Dt)=4,DAY(SALS_SSTFC_Eff_Dt)<6),YEAR(SALS_SSTFC_Eff_Dt)-1,YEAR(SALS_SSTFC_Eff_Dt))),LSA_Table,4),\"As the customer has used all of their LSA, please update the Event 24 tracker held Here --> M:\\Customer Commitments\\01. RLI Servicing\\04. Transfers\\Event 24\",\"\"))","v":"Please enter effective Date"}]
{"$rows_left_out":2}
{"sheet":"LSA_to_LTA","index":4,"n_rows":23,"n_cols":8,"rows_kept":23,"cut":false,"hidden":false,"merged":[]}
[]
[null,"Has Protection*",null,null,"LSA amount"]
[null,"Protected LTA Amount",null,null,"Date","LSA amount","Tax Year Start","LTA%"]
[null,"Protected LTA Used In Calculations",{"$f":"IF(LSA2LTA_Is_protection=\"\",\"\",\nIF(LEFT(LSA2LTA_Is_protection,2)=\"No\",\"LTA Not Protected. Standard LTA Used\",\nIF(LEFT(LSA2LTA_Is_protection,5)=\"Fixed\",VLOOKUP(LSA2LTA_Is_protection,Protection_Table,2,0),\nIF(LSA2LTA_Prt_amt=\"\",\"Enter \"&LSA2LTA_Is_protection&\" amount in cell above\",LSA2LTA_Prt_amt))))","v":""},null,null,null,{"$f":"IF($E4=\"\",\"\",YEAR($E4)-($E4<=DATE(YEAR($E4),4,5)))","v":""},{"$f":"IF(OR($E4=\"\",LSA2LTA_Is_protection=\"\",AND(LEFT(LSA2LTA_Is_protection,2)<>\"No\",ISNUMBER(Protected_LTA_To_Use)=FALSE)),\"\",\nROUNDDOWN($F4/(IF(LEFT(LSA2LTA_Is_protection,2)=\"No\",IF($G4<YEAR(LSA2LTA_AbolitionDate),VLOOKUP($G4,LTA_Table,4,0)/4,VLOOKUP($G4,LSA_Table,4,1)),\nProtected_LTA_To_Use/4)),4))","v":""}]
[null,"LTA abolition date","2024-04-06",null,null,null,"",""]
[null,null,null,null,null,null,"",""]
[null,null,null,null,null,null,"",""]
[null,null,null,null,null,null,"",""]
[null,null,null,null,null,null,"",""]
[null,null,null,null,null,null,"",""]
[null,null,null,null,null,null,"",""]
[null,null,null,null,null,null,"",""]
[null,null,null,null,null,null,"",""]
[null,null,null,null,null,null,"",""]
[null,null,null,null,null,null,"",""]
{"$rows_left_out":9}
{"sheet":"FVSplit","index":5,"n_rows":12,"n_cols":3,"rows_kept":12,"cut":false,"hidden":false,"merged":[]}
[null,"Eservice Values prior to exit","Factors"]
["IR £",347688.41,{"$f":"BeforeExitIR/TotalFVBeforeExit","v":0.74920520619517039}]
["Savings £",116387.93,{"$f":"BeforeExitSavings/TotalFVBeforeExit","v":0.25079479380482961}]
[null,{"$f":"SUM(BeforeExitIR,BeforeExitSavings)","v":464076.33999999997}]
[]
[]
["Eservice actual Exit Value:",467603.33]
[]
[]
[null,"Revalued IR / Savings"]
["IR £",{"$f":"ROUND(ActualExitValue*IRpct,2)","v":350330.85}]
["Savings £",{"$f":"ROUND(ActualExitValue-B11,2)","v":117272.48}]

{"sheet":"Current_LTA_Rebalance","index":6,"n_rows":14,"n_cols":3,"rows_kept":14,"cut":false,"hidden":false,"merged":[]}
[]
[]
[null,"Policy holder name"]
[null,"Policy number"]
[null,"Quote Date*"]
[null,"LSA used up at quote date by this RL plan*"]
[null,"Total LSA used up at quote date by other RL plans/ providers*"]
[null,"Has Protection*"]
[null,"Protected LSA Amount if Protected"]
[]
[null,"Standard/ Protected LumpSum Allowance to use",{"$f":"IF(OR(IsProtected=\"\",IsProtected=\"No Protection\"),VLOOKUP(IF(MONTH(QuoteDate)<4,YEAR(QuoteDate)-1,IF(AND(MONTH(QuoteDate)=4,DAY(QuoteDate)<6),YEAR(QuoteDate)-1,YEAR(QuoteDate))),LSA_Table,4),Protection_Amount)","v":{"$error":"#N/A"}}]
[]
[null,"LTA% Used by RLG @ Current date",{"$f":"ROUNDDOWN(RL_LSAatQDt/Total_LSA_to_Use,4)","v":{"$error":"#N/A"}}]
[null,"LTA% Used by Other plan @ Current date",{"$f":"ROUNDDOWN(Other_LSAatQDt/Total_LSA_to_Use,4)","v":{"$error":"#N/A"}}]

{"sheet":"TTFAC_Protection","index":7,"n_rows":15,"n_cols":3,"rows_kept":15,"cut":false,"hidden":false,"merged":[]}
[]
[]
[null,"Policy holder name"]
[null,"Policy number"]
[null,"Total LSA Used up @ 06/04/2024*  \n(As per TTFAC certificate)"]
[null,"Total LTA % used up @06/04/2024*\n(As per TTFAC certificate)"]
[null,"Has Protection*"]
[null,"Amount if Protected"]
[null,"Total LSA Used up @ 05/04/2024 by this RL plan*"]
[]
[null,"Standard/ Protected LumpSum Allowance to use",{"$f":"IF(OR(TTFAC_IsProtected=\"\",TTFAC_IsProtected=\"No Protection\"),VLOOKUP(2024,LSA_Table,4),Protected_Amount)","v":268275}]
[]
[null,"LTA% Used by This RLG policy @ 05/04/2024",{"$f":"ROUNDDOWN(Total_LSA_at05042024_RL/TTFAC_Total_LSA_to_Use,4)","v":0}]
[null,"LTA% Used by Other plans @ 05/04/2024",{"$f":" MAX((Total_LTApct_at06042024-LTAat05042024RL),0)","v":0}]
[null,"LSA amount Used by Other plans @ 05/04/2024",{"$f":"Total_LSA_at06042024-Total_LSA_at05042024_RL","v":0}]
{"$rows_left_out":1}
{"sheet":"Glossary","index":8,"n_rows":8,"n_cols":3,"rows_kept":8,"cut":false,"hidden":false,"merged":[]}
[]
[null,{"$f":"\"Term\"","v":"Term"},{"$f":"\"Description\"","v":"Description"}]
[null,"LTA","Lifetime Allowance"]
[null,"SIHLS","Serious Ill Health Lump Sum"]
[null,"RBCE","Relevant Benefit Crystallisation Event"]
[null,"PCLS","Pension Commencement Lump Sum"]
[null,"LSA","Lump Sum Allowance"]
[null,"LSBDA","Lump Sum & Death Benefit Allowance"]

{"sheet":"IntermediateCalcs","index":9,"n_rows":634,"n_cols":31,"rows_kept":634,"cut":false,"hidden":false,"merged":[]}
[]
[null,"Current Age:",{"$f":"DATEDIF(DOB,TodayDate,\"Y\")","v":55},null,null,null,null,null,null,null,"LTA Charge",{"$f":"IF(OR(Uncrystallized <> \"\",Drawdown=\"Drawdown/ Annuity\", Drawdown = \"QROPS\"),25%,55%)","v":0.55000000000000004},null,null,"Is growth?",{"$f":"IF(Input!D18 > (Input!D16-Input!D17), \"Y\",\"N\")","v":"N"},null,null,null,null,{"$f":"SUMIF(S6:S608,MAX(S6:S608),PostA_LTA_prct_Amt)","v":0}]
[null,"Other LTA",{"$f":"ROUNDDOWN(LTA_other_provider+LTA_other_policy,5)","v":0}]
[]
[null,"Pre A-day BCE event","BCE Commencement Date","Type","Crystallization amount requested","GAD Max","LTA Amount","LTA protection","Age at BCE Commencement Date","Tax-Year start date","NMPA @ Tax year","LTA amount @ Tax year","LTA reduction","Calculated LTA amount","%LTA used",null,null,"Post A-day BCE event","BCE Commencement Date","Type","Crystallization amount requested","GAD Max","LTA Amount","LTA protection","Age at BCE Commencement Date","Tax-Year start date","NMPA @ Tax year","LTA amount @ Tax year","LTA reduction?","Calculated LTA Amount","%LTA used"]
[null,1,null,null,null,null,null,null,{"$f":"IF(C6=\"\",\"\",(DATEDIF(DOB,C6,\"Y\")))","v":""},{"$f":"IF(C6=\"\",\"\",IF(MONTH(C6)=4,IF(DAY(C6)>=6,YEAR(C6),YEAR(C6)-1),IF(MONTH(C6)>4,YEAR(C6),YEAR(C6)-1)))","v":""},{"$f":"IFERROR(IF(J6<2006,VLOOKUP(2006,LTA_Table,3),VLOOKUP(J6,LTA_Table,3)),\"\")","v":""},{"$f":"IFERROR(IF(H6=\"Y\",G6,IF(C6=\"\",\"\",VLOOKUP($Z$6,LTA_Table,4))),\"\")","v":""},{"$f":"IF(C6=\"\",\"\",IF(K6>I6,100%-2.5%*DATEDIF(C6,DATE(YEAR(DOB) + K6, MONTH(DOB), DAY(DOB)),\"Y\"),100%))","v":""},{"$f":"IF(L6=\"\",\"\",L6*M6)","v":""},{"$f":"IF(C6=\"\",\"\",IF(D6=\"Annuity\",ROUNDDOWN(25*E6/N6,4),IF($S$6<DATE(2015,4,6),ROUNDDOWN(25*F6/N6,4),ROUNDDOWN(25*80%*F6/N6,4))))","v":""},null,null,1,null,null,null,null,null,null,{"$f":"IF(S6=\"\",\"\",(DATEDIF(DOB,S6,\"Y\")))","v":""},{"$f":"IF(S6=\"\",\"\",IF(MONTH(S6)=4,IF(DAY(S6)>=6,YEAR(S6),YEAR(S6)-1),IF(MONTH(S6)>4,YEAR(S6),YEAR(S6)-1)))","v":""},{"$f":"IFERROR(VLOOKUP(Z6,LTA_Table,3),\"\")","v":""},{"$f":"IFERROR(IF(X6=\"Y\",W6,VLOOKUP(Z6,LTA_Table,4)),\"\")","v":""},{"$f":"IF(S6=\"\",\"\",IF(AA6>Y6,100%-2.5%*DATEDIF(S6,DATE(YEAR(DOB) + AA6, MONTH(DOB), DAY(DOB)),\"Y\"),100%))","v":""},{"$f":"IF(AB6=\"\",\"\",AB6*AC6)","v":""},{"$f":"IF(S6=\"\",\"\",ROUNDDOWN(U6/AD6,4))","v":""}]
[null,2,null,null,null,null,null,null,{"$f":"IF(C7=\"\",\"\",(DATEDIF(DOB,C7,\"Y\")))","v":""},{"$f":"IF(C7=\"\",\"\",IF(MONTH(C7)=4,IF(DAY(C7)>=6,YEAR(C7),YEAR(C7)-1),IF(MONTH(C7)>4,YEAR(C7),YEAR(C7)-1)))","v":""},"","","",{"$f":"IF(L7=\"\",\"\",L7*M7)","v":""},{"$f":"IF(C7=\"\",\"\",IF(D7=\"Annuity\",ROUNDDOWN(25*E7/N7,4),IF($S$6<DATE(2015,4,6),ROUNDDOWN(25*F7/N7,4),ROUNDDOWN(25*80%*F7/N7,4))))","v":""},null,null,2,null,null,null,null,null,null,{"$f":"IF(S7=\"\",\"\",(DATEDIF(DOB,S7,\"Y\")))","v":""},{"$f":"IF(S7=\"\",\"\",IF(MONTH(S7)=4,IF(DAY(S7)>=6,YEAR(S7),YEAR(S7)-1),IF(MONTH(S7)>4,YEAR(S7),YEAR(S7)-1)))","v":""},{"$f":"IFERROR(VLOOKUP(Z7,LTA_Table,3),\"\")","v":""},"","",{"$f":"IF(AB7=\"\",\"\",AB7*AC7)","v":""},{"$f":"IF(S7=\"\",\"\",ROUNDDOWN(U7/AD7,4))","v":""}]
[null,3,null,null,null,null,null,null,"","","","","","",{"$f":"IF(C8=\"\",\"\",IF(D8=\"Annuity\",ROUNDDOWN(25*E8/N8,4),IF($S$6<DATE(2015,4,6),ROUNDDOWN(25*F8/N8,4),ROUNDDOWN(25*80%*F8/N8,4))))","v":""},null,null,3,null,null,null,null,null,null,"","","","","","",""]
[null,4,null,null,null,null,null,null,"","","","","","","",null,null,4,null,null,null,null,null,null,"","","","","","",""]
[null,5,null,null,null,null,null,null,"","","","","","","",null,null,5,null,null,null,null,null,null,"","","","","","",""]
[null,6,null,null,null,null,null,null,"","","","","","","",null,null,6,null,null,null,null,null,null,"","","","","","",""]
[null,7,null,null,null,null,null,null,"","","","","","","",null,null,7,null,null,null,null,null,null,"","","","","","",""]
[null,8,null,null,null,null,null,null,"","","","","","","",null,null,8,null,null,null,null,null,null,"","","","","","",""]
[null,9,null,null,null,null,null,null,"","","","","","","",null,null,9,null,null,null,null,null,null,"","","","","","",""]
[null,10,null,null,null,null,null,null,"","","","","","","",null,null,10,null,null,null,null,null,null,"","","","","","",""]
{"$rows_left_out":620}
{"sheet":"Result","index":10,"n_rows":35,"n_cols":3,"rows_kept":35,"cut":false,"hidden":false,"merged":[]}
[]
["Total LTA% used to date"]
[]
["LTA tax charge paid to HMRC ",null,{"$f":"IF(OR(Uncrystallized <>  \"\",Drawdown= \"Drawdown/ Annuity\", Drawdown=\"QROPS\"),\"**25% of the excess over the available LTA\",\"**Assume the policyholder wants the excess after the LTA charge has been applied to be paid as a lump sum, therefore a 55% LTA charge is applied\")","v":"**Assume the policyholder wants the excess after the LTA charge has been applied to be paid as a lump sum, therefore a 55% LTA charge is applied"}]
[]
["Lump sum after the LTA charge has been applied"]
[]
[]
["LTA% @ 5th April, 2024",0]
["LTA% used up after 5/4/24",0]
[]
[]
["Running Total"]
[]
[null,"Within RL","Other Provider"]
{"$rows_left_out":21}
{"sheet":"LTA Table","index":11,"n_rows":21,"n_cols":5,"rows_kept":21,"cut":false,"hidden":false,"merged":[]}
[]
[null,"Tax year",null,"Normal Minumum Pension Age","LTA amount"]
[null,"Year A","Year B"]
[null,2006,2007,50,1500000]
[null,2007,2008,50,1600000]
[null,2008,2009,50,1650000]
[null,2009,2010,50,1750000]
[null,2010,2011,50,1800000]
[null,2011,2012,55,1800000]
[null,2012,2013,55,1500000]
[null,2013,2014,55,1500000]
[null,2014,2015,55,1250000]
[null,2015,2016,55,1250000]
[null,2016,2017,55,1000000]
[null,2017,2018,55,1000000]
{"$rows_left_out":7}
{"sheet":"LSA Table","index":12,"n_rows":4,"n_cols":5,"rows_kept":4,"cut":false,"hidden":false,"merged":[]}
[]
[null,"Tax year",null,"Normal Minumum Pension Age","LSA amount"]
[null,"Year A","Year B"]
[null,2024,2025,55,268275]

{"sheet":"LSDBA Table","index":13,"n_rows":4,"n_cols":5,"rows_kept":4,"cut":false,"hidden":false,"merged":[]}
[]
[null,"Tax year",null,"Normal Minumum Pension Age","LTA amount"]
[null,"Year A","Year B"]
[null,2024,2025,55,1073100]

{"sheet":"Protection Table","index":14,"n_rows":10,"n_cols":7,"rows_kept":10,"cut":false,"hidden":false,"merged":[]}
[]
[null,"Type Of Protection","Protected LTA Amount",null,"Type Of Protection","Min Protected LTA Amount","Max Protected LTA Amount"]
[null,"No Protection",null,null,"Individual protection 2014 (IP 2014)",1250000,1500000]
[null,"Primary protection (PP)",null,null,"Individual protection 2016 (IP 2016)",1000000,1250000]
[null,"Enhanced protection (EP)",null,null,"Primary protection (PP)",0,999999999]
[null,"Fixed protection (FP)",1800000,null,"Enhanced protection (EP)",0,999999999]
[null,"Fixed protection 2014 (FP 2014)",1500000,null,"Fixed protection (FP)",1800000,1800000]
[null,"Fixed protection 2016 (FP 2016)",1250000,null,"Fixed protection 2014 (FP 2014)",1500000,1500000]
[null,"Individual protection 2014 (IP 2014)",null,null,"Fixed protection 2016 (FP 2016)",1250000,1250000]
[null,"Individual protection 2016 (IP 2016)"]

{"sheet":"VersionHistory","index":15,"n_rows":29,"n_cols":4,"rows_kept":29,"cut":false,"hidden":false,"merged":[]}
["Version","Date","Author","Comments"]
[1,"2022-04-28","Amrita Panja","Intial version: Calculates Life Time Allowance, LACs and LCLS"]
[1.01,"2023-03-21","Amrita Panja","TAX Year Update: 2023\nLTA TAble\nUpdate NMPA and LTA"]
[1.02,"2024-02-23","Amrita Panja","LSA_to_LTA\nAdded new worksheet to convert LSA to LTA"]
[null,null,null,"Input_Output_LSA\nAdded new worksheet to calculate LSA and LSDBA remaining"]
[null,null,null,"LSA Table\nAdded new worksheet to store LSA from 06/04/2024 onwards"]
[null,null,null,"LSDBA Table\nAdded new worksheet to store LSDBA from 06/04/2024 onwards"]
[null,null,null,"Protection Table\nAdded new worksheet to store protection amounts for all protection types and range of permitted protection amounts for protections where amoungt is not a single value"]
[null,null,null,"IntermediateCalcs\nAdded named range LTA_after_5April in cell B9 to show LTA% used up after 05/04/2024\nAdded named range LTA_at_5_April in cell B10 to show LTA% used up at 05/04/2024"]
[null,null,null,"Result\nAdded named range Res_LTA_after_5April in cell C79 to show LTA% used up after 05/04/2024 copied from 'IntermediateCalcs' by VBA\nAdded named range Res_LTA_at_5_April in cell C81 to show LTA% used up at 05/04/2024 copied from 'IntermediateCalcs' by VBA"]
[null,null,null,"VBA\nSee VBA mdlVersionHistory"]
["2.00","2024-03-26","Ade Brandwood","VBA Changes => \n* New module called mdl_User_View_Settings => This will set the view based on internal or external users. External users only see a simplied version of Input_Output_LSA and the cells are RL branded\n* Commented out the Workbook_BeforeSave \n* In Workbook_Open added a call to the new Set_User_View routine & removed the call to Protection_On (because Set_User_View uses Protection_Off and then Protection_On)\n* Protection_On and Protection_Off added a line to Protect / Unprotect the workbook\n\nWorkbook Changes =>\nInput_Output_LSA =>\n* LSA_Is_Protected cell set Wrap Text as a cell property\n* Deleted Comments from these cells:- LSA_DOB, LSA_Q_Date, LSA_Curr_LTA, B15, LSA_LTAAftApril\n* Added picture called RL_Logo\n* Created new named ranges called Hide_Externally_Rows & Hide_Externally_Columns\n* Set property on Userform LSA_Copy_Input in Format Control to \"don't move\"\n* Changed the range for Inputs_Fields on Input_Output_LSA to the below because it included some cells that were formulas\n=Input_Output_LSA!$C$6:$C$9,Input_Output_LSA!$C$12,Input_Output_LSA!$C$15:$C$17,Input_Output_LSA!$I$15,Input_Output_LSA!$I$17,Input_Output_LSA!$I$19:$I$21,Input_Output_LSA!$C$20:$C$22,Input_Output_LSA!$B$26:$D$56,Input_Output_LSA!$H$26:$I$56\n\nLSA_to_LTA =>\n* Added picture called RL_Logo"]
[2.0099999999999998,"2024-03-27","Ade Brandwood","VBA Changes => Commented out the Worksheet_Change routine for LSA_to_LTA worksheet\n\nLSA_to_LTA=> Inserted a new column to work out the tax year start year and changed the LTA % Used formula from:-\n=IF(B8=\"\",\"\",ROUND(IF(B8<LSA2LTA_AbolitionDate,C8/(0.25*(IF(LSA2LTA_Is_protection=\"No Protection\",VLOOKUP(IF(MONTH(B8)<4,YEAR(B8)-1,IF(AND(MONTH(B8)=4,DAY(B8)<6),YEAR(B8)-1,YEAR(B8))),LTA_Table,4),LSA2LTA_Prt_amt))),C8/IF(LSA2LTA_Is_protection=\"No Protection\",VLOOKUP(IF(MONTH(B8)<4,YEAR(B8)-1,IF(AND(MONTH(B8)=4,DAY(B8)<6),YEAR(B8)-1,YEAR(B8))),LSA_Table,4),(0.25*LSA2LTA_Prt_amt))),4))\nTo this:-\n=IF(OR($B9=\"\",LSA2LTA_Is_protection=\"\",ISNUMBER(Protected_LTA_To_Use)=FALSE),\"\",\nROUNDDOWN($C9/(IF(LEFT(LSA2LTA_Is_protection,2)=\"No\",IF($D9<YEAR(LSA2LTA_AbolitionDate),VLOOKUP($D9,LTA_Table,4,0)/4,VLOOKUP($D9,LSA_Table,4,1)),\nProtected_LTA_To_Use/4)),4))\n\nRemoved data validation from the LSA2LTA_Prt_amt input cell\nAdded named range called Protected_LTA_To_Use and this selected the LTA to use if there is Protection\nMoved the table to right of the LTA inputs and deleted 5 rows from the table so the LTA used result can be seen without having to scroll the page down.\n\n\nGlossary => New Workshet Added"]
[2.02,"2024-04-03","David Martin","Input_Output_LSA\nAltered formula in D65 to refer to LSA_Std_LTA_at6April instead of LSA_LSDBA_Reduced"]
[2.0299999999999998,"2024-04-19","Alan Maxwell","Input\nMinor wording changes to some headings and added a couple of comments to some table column headers - requested by Richard Cain (SCTASK0269050).\nAlso made minor update to ClearInputs in the VBA"]
{"$rows_left_out":14}